Home > Error Cannot > Error Cannot Compute Sizeof Int 77

Error Cannot Compute Sizeof Int 77

Contents

no checking for ANSI C header files... yes checking for sysexits.h... I tried the --without-mysql and --without-pgsql, still the same problem. Page 1 of 2 1 2 > Search this Thread 08-16-2004, 05:01 AM #1 irfanali LQ Newbie Registered: Jul 2004 Location: Italy Distribution: Red Hat 8 Posts: 11 his comment is here

Here are some possibilities: Different Compilers Amanda gets a set of compiler flags directly from glib (well, via pkg-config --cflags glib-2.0). no checking for assembler .weak directive... configure:600: checking host system type configure:621: checking target system type configure:639: checking build system type configure:694: checking for a BSD compatible install configure:747: checking whether ln works configure:771: checking whether ln configure: error: in /private/var/folders/wj/jjhjt_0d3kg1vmk56d5bq_38001kr8/T/spack-stage/spack-stage-r5wJGI/Python-2.7.8':
configure: error: cannot compute sizeof (size_t)
Seeconfig.log' for more details ==> Error: command './configure --prefix=/Users/harrison37/Work/uberenv/spack/opt/macosx_10.9_x86_64/[email protected]/[email protected] --without-gcc --enable-shared' returned error code 77 tgamblin added a commit that referenced https://wiki.zmanda.com/index.php/Configure:_error:_cannot_compute_sizeof_(int)

Error Cannot Compute Sizeof Int 77

autoconf checking whether autoconf works... Solution Check config.log (see Reading config.log) The last compiler invocation in the "Core tests" section will show, in detail, what errors configure encountered. yes checking sys/utsname.h usability... no checking sys/resource.h usability...

no checking for sys/mkdev.h... (cached) yes checking for term.h... no checking for suffix of executables... yes checking for poll.h... Don't waste any more time.

i686-pc-linux-gnu checking for mpif90... no checking for mode_t... no checking for bluetooth/bluetooth.h... I'm doing the building on a dual G5 with OSX Tiger and GCC 4.0.0 (that came with the apple's developer tools).

Best regards, Mahmoud Payami -------------- next part -------------- An HTML attachment was scrubbed... Note that registered members see fewer ads, and ContentLink is completely disabled once you log in. yes checking for sys/stat.h... yes checking termios.h presence...

yes checking fcntl.h presence... yes checking sys/time.h presence... Error Cannot Compute Sizeof Int 77 yes checking for int32_t... no checking for c++...

configure:1641: $? = 0 configure:1643: gcc -v &5 Reading specs from /usr/lib/gcc-lib/i486-slackware-linux/3.2.3/specs Configured with: ../gcc-3.2.3/configure --prefix=/usr --enable-shared --enable-threads=posix --enable-__cxa_atexit --disable-checking --with-gnu-ld --verbose --target=i486-slackware-linux --host=i486-slackware-linux Thread model: posix gcc version 3.2.3 this content yes checking libintl.h usability... yes checking for dlfcn.h... no checking ncurses.h presence...

make[1]: *** [configure-target-libiberty] Error 1 There doesn't appear to be anything particularly unusual in config.log: This file contains any messages produced by compilers while running configure, to aid debugging if configure Press the edit button and paste the text between the two and tags below. yes checking sysexits.h presence... weblink I then wanted to compile again to use these libraries.

yes checking thread.h usability... yes checking for sys/select.h... Invocation command line was $ ./configure ## --------- ## ## Platform. ## ## --------- ## hostname = server uname -m = i686 uname -r = 2.4.22 uname -s = Linux uname

gcc checking for suffix of object files...

Contact Us - Advertising Info - Rules - LQ Merchandise - Donations - Contributing Member - LQ Sitemap - Main Menu Linux Forum Android Forum Chrome OS Forum Search LQ Messages (4) msg60980 - (view) Author: arrecostao (arrecostao) Date: 2006-08-22 00:56 Getting multiple error messages when using ./configure # uname -a SunOS cromagnon 5.10 Generic i86pc i386 i86pc # ./configure checking For me, the only error message I'm seeing is: /System/Library/Frameworks/CoreGraphics.framework/Headers/CGFont.h:53:40: error: initializer element is not constant eschnett commented Jun 21, 2016 @adamjstewart What compiler are you using? Lawrence Livermore National Laboratory member cyrush commented Mar 30, 2016 @tgamblin - this is the approach I am using in driver code that calls spack: if "darwin" in platform.system().lower(): dep_tgt =

Find More Posts by masand 08-25-2004, 11:36 PM #12 RJARRRPCGP Member Registered: Feb 2004 Location: USA (Springfield, Windsor County, Vermont) Posts: 57 Rep: Maybe a hardware problem? My workplace uses a Solaris 8 network. ok checking whether GCC supports -static-libgcc... -static-libgcc checking for bash... /bin/sh checking for gawk... check over here I think starting with El Capitan we can't do that and support newer C++ features.

no checking sys/param.h usability... yes checking for sys/un.h...