Home > Error C2059 > Error C2059

Error C2059

Contents

Unix command that immediately returns a particular return code? You may also get this error if you put a pointer as the index to an array. C used to require that variables be declared at the top of a block, after the opening { and before executable statements. Regression when the dependent variable is between 0 and 1 Why are three-bladed helicopters relatively rare? http://megavoid.net/error-c2059/error-c2059-in.html

Please help Error 1 error C2143: syntax error : missing ')' before ';' test Error 2 error C2059: syntax error : ')' 3 IntelliSense: expected a ')' 4 IntelliSense: expected an I.e #define TEST 87 will replace all TEST in your code with the number 87. Learn More. because the compiler will do 3-1*3-1, and will ignore the parathesis. https://msdn.microsoft.com/en-us/library/t8xe60cf.aspx

Error C2059

error C2143: syntax error : missing ';' before 'type' If this error message points you to the begining of a function, you are missing a ' } ' before that That is a good point. Stopping time, by speeding it up inside a bubble The need for the Gram–Schmidt process more hot questions question feed lang-c about us tour help blog chat data legal privacy policy Stay logged in Log in with Facebook Menu Home Forum Forum Quick Links Search Forums Featured Threads Archive Featured Threads Recent Posts 2016 MFE Rankings Tracker Tracker Quick Links Tracker My

Message Insert Code Snippet Alt+I Code Inline Code Link H1 H2 Preview Submit your Reply Alt+S Ask a Different Software Development Question Related Articles My C++ code works on Windows but Yes, my password is: Forgot your password? error C2371: 'func' : redefinition; different basic types see declaration of 'func' (' func' is the name of a function) warning C4029: declared formal parameter list different from definition Error C2059 Syntax Error 'bad Suffix On Number' Think of a macro as a substitution.

When do you use a colon? conditional compilations are used like this: #ifndef MAX2 #define MAX2 (code: if variable 'a' is greater than variable 'b', then return variable 'a', else, return variable 'b') #endif Click Vertical align top in multicolumn Proof of infinitely many prime numbers Etymology of word "тройбан"? http://stackoverflow.com/questions/22559179/error-c2059-syntax-error-type void parser(string line, int fileNo, class HashTable & HT, frequencyList FL[]) { // Variables declarations char * cStr, * cPtr; string tempString; // Define cStr = the size of line

Where are the oil platforms in Google Earth? Error C2059 Syntax Error 'public' C/C++ Building Reference C/C++ Build Errors Compiler Errors C2001 through C2099 Compiler Errors C2001 through C2099 Compiler Error C2059 Compiler Error C2059 Compiler Error C2059 Compiler Error C2001 Compiler Error C2002 In Max 3 you can actually call Max 2 to make the code imipler: like Max2(a,b)>c..... #6 Hongchi Zhang, 12/5/14 Pavlos Sakoglou likes this. thanks for replying...

Error C2059 Syntax Error 'constant'

Some got some help from here. http://stackoverflow.com/questions/26901765/can-some-one-have-a-look-at-my-code-error-c2059-syntax-error-public Also: = has lower priority , so the line while(c=fgetc(file)!='\n') is going to set c to either 1 or 0. Error C2059 Was any city/town/place named "Washington" prior to 1790? Error C2059 Syntax Error 'type' Did you forget a ';'? 1>c:\users\administrator\desktop\algebra\algebra\ccos.h(6): error C2143: syntax error : missing ';' before ':' 1>c:\users\administrator\desktop\algebra\algebra\ccos.h(6): error C2059: syntax error : ':' 1>c:\users\administrator\desktop\algebra\algebra\ccos.h(6): error C2059: syntax error : 'public' 1>c:\users\administrator\desktop\algebra\algebra\ccos.h(6): error

Post the whole error description, please. –Kiril Kirov Mar 21 '14 at 12:47 2 should be line[n++] = (char)c; –BLUEPIXY Mar 21 '14 at 12:49 Oh god sorry http://megavoid.net/error-c2059/error-c2059-constant.html QUANTNET INC 576 FIFTH AVE, SUITE 903 NEW YORK, NY 10036 Quick Navigation Home Contact Us Advertise Post a Job Useful links C++ Online Certificate QuantNet Guide and Reading List Quant Treat my content as plain text, not as HTML Preview 0 … Existing Members Sign in to your account ...or Join us Download, Vote, Comment, Publish. because the compiler will do 3-1*3-1, and will ignore the parathesis. Error C2059 Syntax Error ' ' Cuda

I have defined my macro as #ifndef MAX2 #define MAX2(x,y)(logic);// using ?: operator between x and y #endif When I call using printf("maximum of two value is %d", MAX2(x,y)); I get As it is, your declaration says that the last two parameters are references while the definition says that the second and third parameters are references and the last two are simple Join them; it only takes a minute: Sign up error: C2059: syntax error : '{' up vote 1 down vote favorite I would like to run an application in qt creator. navigate here Can Klingons swim?

share|improve this answer edited Mar 21 '14 at 12:57 answered Mar 21 '14 at 12:50 M.M 71.6k662131 Are you sure, it's a syntax error? Error C2059 Syntax Error 'if' In this case, it's slightly more complicated due to the input variables but you need to provide a substitution that will accurately calculate the max #4 APalley, 8/8/14 Pavlos Sakoglou It's now ok. –CppMonster Mar 21 '14 at 12:52 add a comment| 3 Answers 3 active oldest votes up vote 3 down vote accepted line[n++] = char(c); is a syntax error.

Is my teaching attitude wrong?

Useful Searches Recent Posts C++ Programing for Financial Engineering Online Certificate. In other words, { .blah = 42 }; is illegal in C++. This is not the source of the error. Error C2059 Syntax Error '__declspec(dllexport)' Terms of Service Layout: fixed | fluid CodeProject, 503-250 Ferrand Drive Toronto Ontario, M3C 3G8 Canada +1 416-849-8900 x 100

Browse other questions tagged c++ or ask your own question. Even all the condition fails, something is returned. I am almost frustrated since this the first time I wrote such a big project... –Jessica Jin Nov 13 '14 at 5:18 1 @AliKazmi: don't argue with the compiler, instead his comment is here My math students consider me a harsh grader.

The braces in the Cos class are balanced. Facebook Twitter LinkedIn Email Michael Harper New Member C++ Level 3 Hey @APalley When calling the MAX2 and MAX3 macros I keep getting the error: c2059: syntax error : ')'. It's only valid in the C99 dialect of C—it's invalid in C89 and in all versions of C++. How do I input n repetitions of a digit in bash, interactively How can I have low-level 5e necromancer NPCs controlling many, many undead in this converted adventure?

Also, you should use the conditional compilation for avoiding multiple inclusions . When answering a question please: Read the question carefully. Not the answer you're looking for? What's wrong with this code? #include #include void getline(FILE* file, char* line) { int c; size_t n = 0; while(c=fgetc(file)!='\n') { line[n++] = char(c); } line[n] = '\0'; }

Allow multiple GUI elements to react dynamically to interaction with a single element Making the parsing of a String to an Int32 robust (valid, positive, not 0 validation) Converting SCART to utilities::CLogFile m_log; I hope this helps! ^_^ rpgfan Last edited on Apr 26, 2008 at 5:33pm UTC Apr 26, 2008 at 6:31pm UTC closed account (j6pf92yv) Ahhhh ..... The error message should refer to a line and file where the error occurred. Insults are not welcome.

Proof of infinitely many prime numbers How do I input n repetitions of a digit in bash, interactively What part of speech is "нельзя"? more hot questions question feed lang-cpp about us tour help blog chat data legal privacy policy work here advertising info mobile contact us feedback Technology Life / Arts Culture / Recreation You should remove the using namespace std; from your header file and prefix everything that needs to be with std::.